[ClusterLabs] SBD build problem

Valentin Vidić vvidic at valentin-vidic.from.hr
Sun Nov 10 10:01:25 EST 2019


I have some problems building the latest sbd from the repo, it seems like
the file 'tests-opt.m4' might be missing?


Command: dpkg-buildpackage -us -uc -rfakeroot
dpkg-buildpackage: info: source package sbd
dpkg-buildpackage: info: source version 1.4.0-70-g780a9a1-1
dpkg-buildpackage: info: source distribution unstable
dpkg-buildpackage: info: source changed by Valentin Vidic <vvidic at debian.org>
 dpkg-source --before-build .
dpkg-buildpackage: info: host architecture amd64
 fakeroot debian/rules clean
dh clean
 dpkg-source -b .
dpkg-source: info: using source format '3.0 (quilt)'
dpkg-source: info: building sbd using existing ./sbd_1.4.0-70-g780a9a1.orig.tar.gz
dpkg-source: info: using patch list from debian/patches/series
dpkg-source: info: building sbd in sbd_1.4.0-70-g780a9a1-1.debian.tar.xz
dpkg-source: info: building sbd in sbd_1.4.0-70-g780a9a1-1.dsc
 debian/rules build
dh build
aclocal: error: configure.ac:25: file 'tests-opt.m4' does not exist
autoreconf: aclocal failed with exit status: 1
dh_autoreconf: autoreconf -f -i returned exit code 1
make: *** [debian/rules:14: build] Error 255
dpkg-buildpackage: error: debian/rules build subprocess returned exit status 2


More information about the Users mailing list