[Pacemaker] pacemaker 1.1.11 rc1 compilation error on RHEL6.5

Andrew Beekhof andrew at beekhof.net
Sun Dec 1 19:24:04 EST 2013

On Sun, Nov 24, 2013, at 06:20 PM, T.J. Yang wrote:


Any pointer for the following compilation errors ?

[tjyang at pm1 services]$ make
  CC     libcrmservice_la-upstart.lo
cc1: warnings being treated as errors
upstart.c: In function ‘upstart_job_property’:
upstart.c:264: error: implicit declaration of function

Can you check what version of glib introduced that function and compare
it to the version you have?
I'm surprised to see that pacemaker is trying to build upstart
support... i can't imagine it doing anything on rhel6

upstart.c:264: error: nested extern declaration of
upstart.c:264: error: assignment makes pointer from integer without a
make: *** [libcrmservice_la-upstart.lo] Error 1
[tjyang at pm1 services]$ pwd
[tjyang at pm1 services]$


T.J. Yang


Pacemaker mailing list: [1]Pacemaker at oss.clusterlabs.org


Project Home: [3]http://www.clusterlabs.org

Getting started:

Bugs: [5]http://bugs.clusterlabs.org


1. mailto:Pacemaker at oss.clusterlabs.org
2. http://oss.clusterlabs.org/mailman/listinfo/pacemaker
3. http://www.clusterlabs.org/
4. http://www.clusterlabs.org/doc/Cluster_from_Scratch.pdf
5. http://bugs.clusterlabs.org/
-------------- next part --------------
An HTML attachment was scrubbed...
URL: <http://lists.clusterlabs.org/pipermail/pacemaker/attachments/20131201/eaa5cb47/attachment-0002.html>

More information about the Pacemaker mailing list